Target
Voltage-dependent calcium channel gamma-2 subunit
Ligand
BDBM292030
Substrate
Meas. Tech.
Biological Assays Calcium Flux Assay
pH
7.4±n/a
IC50
316±n/a nM
Comments
extracted
Citation
 Ameriks, MKLaforteza, BNSavall, BMWade, WSMeyer, STGyuris, M 3-aryl-2H-pyrazolo[4,3-b]pyridine compounds and their use as AMPA receptor modulators US Patent  US10100045 Publication Date 10/16/2018 
Target
Name:
Voltage-dependent calcium channel gamma-2 subunit
Synonyms:
CACNG2 Neuronal voltage-gated calcium channel gamma-2 subunit Transmembrane AMPAR regulatory protein gamma-2
Type:
Enzyme Catalytic Domain
Mol. Mass.:
35977.54
Organism:
Homo sapiens (Human)
Description:
Residue:
323
  
Inhibitor
Name:
BDBM292030
Synonyms:
5-(2-Methyl-5-(trifluoromethyl)-2H-pyrazolo[4,3-b]pyridin-3-yl)-1,3-dihydro-2H- | US10100045, Example 1
Type:
Small organic molecule
Emp. Form.:
C15H10F3N5O
Mol. Mass.:
333.268
SMILES:
Cn1nc2ccc(nc2c1-c1ccc2[nH]c(=O)[nH]c2c1)C(F)(F)F
: