Target
Voltage-dependent calcium channel gamma-2 subunit
Ligand
BDBM292061
Substrate
Meas. Tech.
Biological Assays Calcium Flux Assay
pH
7.4±n/a
IC50
0.100±n/a nM
Comments
extracted
Citation
 Ameriks, MKLaforteza, BNSavall, BMWade, WSMeyer, STGyuris, M 3-aryl-2H-pyrazolo[4,3-b]pyridine compounds and their use as AMPA receptor modulators US Patent  US10100045 Publication Date 10/16/2018 
Target
Name:
Voltage-dependent calcium channel gamma-2 subunit
Synonyms:
CACNG2 Neuronal voltage-gated calcium channel gamma-2 subunit Transmembrane AMPAR regulatory protein gamma-2
Type:
Enzyme Catalytic Domain
Mol. Mass.:
35977.54
Organism:
Homo sapiens (Human)
Description:
Residue:
323
  
Inhibitor
Name:
BDBM292061
Synonyms:
5-(Difluoromethyl)-2-isopropyl-3-(7-methyl-1H-indazol-5-yl)-2H-pyrazolo[4,3- | US10100045, Example 34
Type:
Small organic molecule
Emp. Form.:
C18H17F2N5
Mol. Mass.:
341.3579
SMILES:
CC(C)n1nc2ccc(nc2c1-c1cc(C)c2[nH]ncc2c1)C(F)F
: