Target
Polyphenol oxidase 1
Ligand
BDBM233016
Substrate
Meas. Tech.
MT Kinetic Assay
pH
6.8±0
Temperature
310.15±0 K
Ki
9.5e+2± 2.5e+2 nM
Citation
 Amin, ESaboury, AAMansuri-Torshizi, HMoosavi-Movahedi, AA Potent inhibitory effects of benzyl and p-xylidine-bis dithiocarbamate sodium salts on activities of mushroom tyrosinase. J Enzyme Inhib Med Chem 25:272-81 (2010)  
Target
Name:
Polyphenol oxidase 1
Synonyms:
PPO1 Polyphenol oxidase | Tyrosinase
Type:
Enzyme
Mol. Mass.:
63902.83
Organism:
Agaricus bisporus (White button mushroom)
Description:
Q00024
Residue:
568
  
Inhibitor
Name:
BDBM233016
Synonyms:
p-Xylidine-bis(dithiocarbamate) sodium salt (II)
Type:
Small organic molecule
Emp. Form.:
C10H10N2S4
Mol. Mass.:
286.461
SMILES:
[S-]C(=S)NCc1ccc(CNC([S-])=S)cc1
: