Target
Serine protease 1
Ligand
BDBM234253
Substrate
Meas. Tech.
Inhibition Assay
pH
8±n/a
Ki
0.38±n/a nM
Comments
extracted
Citation
 Suzuki, TKoshiba, TTokumasu, MOhsumi, K Heterocyclic carboxylic acid ester derivative US Patent  US9346821 Publication Date 5/24/2016 
Target
Name:
Serine protease 1
Synonyms:
Alpha-trypsin chain 1 Beta-trypsin PRSS1 TRP1 TRY1_HUMAN Thrombin & trypsin Trypsin I | Trypsin-1
Type:
Enzyme
Mol. Mass.:
26557.80
Organism:
Homo sapiens (Human)
Description:
P07477
Residue:
247
  
Inhibitor
Name:
BDBM234253
Synonyms:
US9346821, B-26
Type:
Small organic molecule
Emp. Form.:
C24H29FN4O7S
Mol. Mass.:
536.573
SMILES:
CC(C)[C@H](N(C)Cc1ccc(s1)C(=O)Oc1ccc(cc1F)C(N)=N)C(=O)N[C@@H](CCC(O)=O)C(O)=O
: