Target
N-acylethanolamine-hydrolyzing acid amidase
Ligand
BDBM50439653
Substrate
Meas. Tech.
UPLC/MS Assay
pH
4.5±n/a
Temperature
310.15±n/a K
IC50
5±n/a nM
Comments
extracted
Citation
 Piomelli, DBandiera, TMor, MTarzia, GBertozzi, FPonzano, S Disubstituted beta-lactones as inhibitors of N-acylethanolamine acid amidase (NAAA) US Patent  US9353075 Publication Date 5/31/2016 
Target
Name:
N-acylethanolamine-hydrolyzing acid amidase
Synonyms:
ASAH-like protein Acid ceramidase-like protein N-acylsphingosine amidohydrolase-like NAAA PLT
Type:
Enzyme
Mol. Mass.:
40073.12
Organism:
Homo sapiens (Human)
Description:
Q02083
Residue:
359
  
Inhibitor
Name:
BDBM50439653
Synonyms:
CHEMBL2419830 | US9353075, 35
Type:
Small organic molecule
Emp. Form.:
C16H27NO4
Mol. Mass.:
297.3899
SMILES:
C[C@@H]1OC(=O)[C@@H]1NC(=O)OCCCCCC1CCCCC1
: