Target
Cytochrome P450 11B2, mitochondrial
Ligand
BDBM233824
Substrate
Meas. Tech.
Cellular Enzyme Assay
Temperature
310.15±n/a K
EC50
10.2±n/a nM
Comments
extracted
Citation
 Aebi, JAmrein, KFantasia, SMHornsperger, BKuhn, BLiu, YMaerki, HPMayweg, AVMohr, PScalone, MTan, XZhou, M Bicyclic dihydroquinoline-2-one derivatives US Patent  US9353081 Publication Date 5/31/2016 
Target
Name:
Cytochrome P450 11B2, mitochondrial
Synonyms:
Aldosterone Synthase (CYP11B2) Aldosterone-synthesizing enzyme CYP11B2 Cytochrome P450 11B2 Cytochrome P450 11B2, mitochondrial P-450C18 | Steroid 18-hydroxylase
Type:
Protein
Mol. Mass.:
57582.15
Organism:
Homo sapiens (Human)
Description:
P19099
Residue:
503
  
Inhibitor
Name:
BDBM233824
Synonyms:
US9353081, 22 US9353081, 24
Type:
Small organic molecule
Emp. Form.:
C21H22FN3O2
Mol. Mass.:
367.4167
SMILES:
CCC(=O)NC1CCc2c1cncc2-c1cc2CCC(=O)N(C)c2cc1F
: