Target
Isoform 1 of Metabotropic glutamate receptor 5 (5a)
Ligand
BDBM234213
Substrate
Meas. Tech.
Binding Assay
pH
7.4±n/a
Ki
46±n/a nM
Comments
extracted
Citation
 Jaeschke, GLindemann, LRicci, ARueher, DStadler, HVieira, E Ethynyl derivatives US Patent  US9359301 Publication Date 6/7/2016 
Target
Name:
Isoform 1 of Metabotropic glutamate receptor 5 (5a)
Synonyms:
GPRC1E GRM5_HUMAN Metabotropic glutamate receptor 5 Metabotropic glutamate receptor 5 (mGlu5a) Metabotropic glutamate receptor 5a (mGluR5) Metabotropic glutamate receptor subtype 5 (mGluR5)
Type:
Enzyme
Mol. Mass.:
128885.13
Organism:
Homo sapiens (Human)
Description:
P41594-2
Residue:
1180
  
Inhibitor
Name:
BDBM234213
Synonyms:
US9359301, 4
Type:
Small organic molecule
Emp. Form.:
C19H20ClN3O
Mol. Mass.:
341.835
SMILES:
CCN(C(=O)c1ncc(cn1)C#Cc1cccc(Cl)c1)C(C)(C)C
: