Target
Cytosol aminopeptidase [33-68,L62W]
Ligand
BDBM234294
Substrate
Meas. Tech.
Kinetic Inhibition Assay
pH
8.4±0
Temperature
298.15±0 K
Ki
2.26e+4±n/a nM
Citation
 Pícha, JLiboska, RBude?ínský, MJirácek, JPawelczak, MMucha, A Unusual activity pattern of leucine aminopeptidase inhibitors based on phosphorus containing derivatives of methionine and norleucine. J Enzyme Inhib Med Chem 26:155-61 (2011)  
Target
Name:
Cytosol aminopeptidase [33-68,L62W]
Synonyms:
AMPL_PIG LAP3 | Leucine aminopeptidase (LAP)
Type:
Enzyme
Mol. Mass.:
4015.44
Organism:
Sus scrofa (Pig)
Description:
P28839[33-68,L62W]
Residue:
36
  
Inhibitor
Name:
BDBM234294
Synonyms:
Met-P (1)
Type:
Small organic molecule
Emp. Form.:
C4H12NO3PS
Mol. Mass.:
185.182
SMILES:
CSCCC(N)P(O)(O)=O
: