Target
L-lactate dehydrogenase A chain
Ligand
BDBM23222
Substrate
Meas. Tech.
LDH Activity Assay
pH
7.4±n/a
IC50
80000±n/a nM
Comments
extracted
Citation
 Rodríguez-Páez, LChena-Taboada, MACabrera-Hernández, ACordero-Martínez, JWong, C Oxamic acid analogues as LDH-C4-specific competitive inhibitors. J Enzyme Inhib Med Chem 26:579-86 (2011)  
Target
Name:
L-lactate dehydrogenase A chain
Synonyms:
L-lactate:NAD+ oxidoreductase A (LDH-A4) Ldh-1 Ldha
Type:
Enzyme
Mol. Mass.:
36502.66
Organism:
Mus musculus (Mouse)
Description:
P06151
Residue:
332
  
Inhibitor
Name:
BDBM23222
Synonyms:
Oxalamic acid Oxamate, 3 carbamoylformic acid
Type:
Small organic molecule
Emp. Form.:
C2H3NO3
Mol. Mass.:
89.0501
SMILES:
NC(=O)C(O)=O
: