Target
Beta-secretase 1
Ligand
BDBM234465
Substrate
Meas. Tech.
SPA-Based Assay
pH
4.5±n/a
Ki
4.3±n/a nM
Comments
extracted
Citation
 Juhl, KMarigo, MTagmose, LJensen, T 2-amino 3,5,5-trifluoro-3,4,5,6-tetrahydropyridines as BACE1 inhibitors for treatment of Alzheimer's disease US Patent  US9353084 Publication Date 5/31/2016 
Target
Name:
Beta-secretase 1
Synonyms:
ASP2 Aspartyl protease 2 BACE1 Beta-secretase (BACE) Beta-secretase 1 (BACE 1) Beta-secretase 1 (BACE1) Beta-site amyloid precursor protein cleaving enzyme 1 Memapsin-2 beta-Secretase (BACE-1) | beta-Secretase (BACE1)
Type:
Protein
Mol. Mass.:
55755.10
Organism:
Homo sapiens (Human)
Description:
P56817
Residue:
501
  
Inhibitor
Name:
BDBM234465
Synonyms:
US10004738, 18 | US9353084, 18
Type:
Small organic molecule
Emp. Form.:
C21H19F4N5O
Mol. Mass.:
433.4021
SMILES:
Cc1cc(cnc1C(=O)Nc1ccc(F)c(c1)[C@@]1(C)N=C(N)[C@@](C)(F)CC1(F)F)C#N
: