Target
Plasmepsin II
Ligand
BDBM234531
Substrate
Meas. Tech.
Enzyme Inhibition Assay
pH
4.5±n/a
Temperature
298.15±n/a K
IC50
12.3±n/a nM
Comments
extracted
Citation
 Chen, XDing, KMeyers, MJTortorella, MDXu, J Compositions and methods for the treatment of malaria US Patent  US9353089 Publication Date 5/31/2016 
Target
Name:
Plasmepsin II
Synonyms:
Aspartic hemoglobinase II PLM2_PLAFX Plasmepsin 2 Plasmepsin-II
Type:
Enzyme
Mol. Mass.:
51482.09
Organism:
Plasmodium falciparum
Description:
P46925
Residue:
453
  
Inhibitor
Name:
BDBM234531
Synonyms:
US9353089, 212
Type:
Small organic molecule
Emp. Form.:
C27H27N3O
Mol. Mass.:
409.5228
SMILES:
N=C1NC(C(=O)N1C1CCCCC1)(c1ccccc1)c1cccc(c1)-c1ccccc1
: