Target
Cholesteryl ester transfer protein
Ligand
BDBM234623
Substrate
Meas. Tech.
In Vitro Radioactive Assays of CETP-Catalyzed CE and TG Transfer (RTA Assay)
pH
7.4±n/a
Temperature
310.15±n/a K
IC50
9±n/a nM
Comments
extracted
Citation
 Acton, III, JJYe, FVachal, PSha, DDropinski, JFChu, LOndeyka, DKim, AJColandrea, VJZang, YZhang, FDong, G Cyclic amine substituted heterocyclic CETP inhibitors US Patent  US9353101 Publication Date 5/31/2016 
Target
Name:
Cholesteryl ester transfer protein
Synonyms:
CETP Cholesteryl ester transfer protein (CETP) | Lipid transfer protein I
Type:
Enzyme
Mol. Mass.:
54751.53
Organism:
Homo sapiens (Human)
Description:
P11597
Residue:
493
  
Inhibitor
Name:
BDBM234623
Synonyms:
US9353101, 19
Type:
Small organic molecule
Emp. Form.:
C33H32F7N7O3
Mol. Mass.:
707.6411
SMILES:
CCn1nc(C)c(c1C)-c1cnc(OC)c(c1)-c1cnc(nc1CN1[C@@H](C)[C@H](OC1=O)c1cc(cc(c1)C(F)(F)F)C(F)(F)F)N1CC(F)C1
: