Target
Fatty acid-binding protein, adipocyte
Ligand
BDBM234708
Substrate
Meas. Tech.
Time Resolved-Fluorescence Energy Transfer (TR-FRET) Assay
pH
7.5±n/a
IC50
25±n/a nM
Comments
extracted
Citation
 Buettelmann, BCeccarelli, SMKuehne, HKuhn, BNeidhart, WObst Sander, URichter, H Non-annulated thiophenylamides US Patent  US9353102 Publication Date 5/31/2016 
Target
Name:
Fatty acid-binding protein, adipocyte
Synonyms:
A-FABP ALBP FABP4 Fatty acid binding protein adipocyte Fatty acid-binding protein 4 (FABP4)
Type:
Enzyme
Mol. Mass.:
14719.23
Organism:
Homo sapiens (Human)
Description:
P15090
Residue:
132
  
Inhibitor
Name:
BDBM234708
Synonyms:
US9353102, 4.14
Type:
Small organic molecule
Emp. Form.:
C16H17N3O3S2
Mol. Mass.:
363.454
SMILES:
Cc1nsc(n1)-c1c(C)c(C)sc1NC(=O)C1=C(CCC1)C(O)=O
: