Target
Fatty acid-binding protein 5
Ligand
BDBM234674
Substrate
Meas. Tech.
Time Resolved-Fluorescence Energy Transfer (TR-FRET) Assay
pH
7.5±n/a
IC50
30±n/a nM
Comments
extracted
Citation
 Buettelmann, BCeccarelli, SMKuehne, HKuhn, BNeidhart, WObst Sander, URichter, H Non-annulated thiophenylamides US Patent  US9353102 Publication Date 5/31/2016 
Target
Name:
Fatty acid-binding protein 5
Synonyms:
FABP5 Fatty acid binding protein epidermal | Fatty acid-binding protein 5 (FABP5)
Type:
Enzyme
Mol. Mass.:
15164.79
Organism:
Homo sapiens (Human)
Description:
Q01469
Residue:
135
  
Inhibitor
Name:
BDBM234674
Synonyms:
US9353102, 3.3
Type:
Small organic molecule
Emp. Form.:
C20H21N3O4S
Mol. Mass.:
399.463
SMILES:
Cc1c(sc(NC(=O)C2=C(CCC2)C(O)=O)c1-c1nc(no1)C1CC1)C1CC1
: