Target
Tumor necrosis factor
Ligand
BDBM135815
Substrate
Meas. Tech.
ELISA Assay
Temperature
298.15±n/a K
IC50
30±n/a nM
Comments
extracted
Citation
 Mjalli, AMGaddam, BPolisetti, DRKostura, MJGuzel, M Tricyclic compounds as modulators of TNF-alpha synthesis and as PDE4 inhibitors US Patent  US9393245 Publication Date 7/19/2016 
Target
Name:
Tumor necrosis factor
Synonyms:
Cachectin TNF-a TNFA TNFSF2 Tumor necrosis factor (TNFa) Tumor necrosis factor ligand superfamily member 2 Tumor necrosis factor, soluble form | tumor necrosis factor alpha
Type:
Enzyme
Mol. Mass.:
25645.11
Organism:
Homo sapiens (Human)
Description:
P01375
Residue:
233
  
Inhibitor
Name:
BDBM135815
Synonyms:
US10085990, Example 51 US8853226, 51 US9833457, 51
Type:
Small organic molecule
Emp. Form.:
C22H21N3O3S
Mol. Mass.:
407.485
SMILES:
COc1cccc2c1ncc1c2n(C2CCCC2)c(=O)n(-c2cc(C)cs2)c1=O
: