Target
Tumor necrosis factor
Ligand
BDBM135817
Substrate
Meas. Tech.
ELISA Assay
Temperature
298.15±n/a K
IC50
2±n/a nM
Comments
extracted
Citation
 Mjalli, AMGaddam, BPolisetti, DRKostura, MJGuzel, M Tricyclic compounds as modulators of TNF-alpha synthesis and as PDE4 inhibitors US Patent  US9393245 Publication Date 7/19/2016 
Target
Name:
Tumor necrosis factor
Synonyms:
Cachectin TNF-a TNFA TNFSF2 Tumor necrosis factor (TNFa) Tumor necrosis factor ligand superfamily member 2 Tumor necrosis factor, soluble form | tumor necrosis factor alpha
Type:
Enzyme
Mol. Mass.:
25645.11
Organism:
Homo sapiens (Human)
Description:
P01375
Residue:
233
  
Inhibitor
Name:
BDBM135817
Synonyms:
US10085990, Example 84 US8853226, 84 US9833457, 84
Type:
Small organic molecule
Emp. Form.:
C24H21N3O5
Mol. Mass.:
431.4406
SMILES:
COc1cccc2c1ncc1c2n(C2CCCC2)c(=O)n(-c2ccc3OCOc3c2)c1=O
: