Target
Cyclin-dependent kinase 4/G1/S-specific cyclin-D1 [L188C]
Ligand
BDBM6373
Substrate
GST-Rb fusion protein
Meas. Tech.
CDKs Assay
IC50
52±n/a nM
Citation
 VanderWel, SNHarvey, PJMcNamara, DJRepine, JTKeller, PRQuin, JBooth, RJElliott, WLDobrusin, EMFry, DWToogood, PL Pyrido[2,3-d]pyrimidin-7-ones as specific inhibitors of cyclin-dependent kinase 4. J Med Chem 48:2371-87 (2005)  
Target
Name:
Cyclin-dependent kinase 4/G1/S-specific cyclin-D1 [L188C]
Synonyms:
CDK4/Cyclin D | Cyclin-Dependent Kinase 4 (CDK4)
Type:
Protein Complex
Mol. Mass.:
Description:
CDK4/D complexes were purified from insect cells co-infected with baculovirus vectors containing each of the components.
Components:
This complex has 2 components.
Component 1
Name:
Cyclin-dependent kinase 4
Synonyms:
CDK4 Cell division protein kinase 4 PSK-J3
Type:
Enzyme Subunit
Mol. Mass.:
33731.96
Organism:
Homo sapiens (Human)
Description:
P11802
Residue:
303
  
Component 2
Name:
G1/S-specific cyclin-D1 [L188C]
Synonyms:
BCL1 CCND1_HUMAN PRAD1
Type:
Enzyme Subunit
Mol. Mass.:
33634.57
Organism:
Homo sapiens (Human)
Description:
P24385[L188C]
Residue:
295
  
Inhibitor
Name:
BDBM6373
Synonyms:
8-Cyclopentyl-2-(4-[1,4]diazepan-1-yl-phenylamino)-5-methyl-8H-pyrido[2,3-d]pyrimidin-7-one pyrido[2,3-d]pyrimidin-7-one 20
Type:
Small organic molecule
Emp. Form.:
C24H30N6O
Mol. Mass.:
418.5346
SMILES:
Cc1cc(=O)n(C2CCCC2)c2nc(Nc3ccc(cc3)N3CCCNCC3)ncc12
:
Substrate
Name:
GST-Rb fusion protein
Synonyms:
Glutathione S-transferase (GST)-retinoblastoma (Rb) fusion RB1 Rb | retinoblastoma
Type:
Other Protein Type
Mol. Mass.:
106410.17
Organism:
Homo sapiens (Human)
Description:
GST-60 kDa Rb fusion protein (comprising amino acids 378 to 928 of retinoblastoma)
Residue:
928