Target
Cyclin-dependent kinase 2/G1/S-specific cyclin-E1
Ligand
BDBM6358
Substrate
GST-Rb fusion protein
Meas. Tech.
CDKs Assay
IC50
80±n/a nM
Citation
 VanderWel, SNHarvey, PJMcNamara, DJRepine, JTKeller, PRQuin, JBooth, RJElliott, WLDobrusin, EMFry, DWToogood, PL Pyrido[2,3-d]pyrimidin-7-ones as specific inhibitors of cyclin-dependent kinase 4. J Med Chem 48:2371-87 (2005)  
Target
Name:
Cyclin-dependent kinase 2/G1/S-specific cyclin-E1
Synonyms:
CDK2/CycE CDK2/E Cyclin-Dependent Kinase 2 (CDK2) Cyclin-dependent kinase 2/cyclin E1
Type:
Protein
Mol. Mass.:
Description:
Components:
This complex has 2 components.
Component 1
Name:
Cyclin-dependent kinase 2
Synonyms:
CDK2 CDK2_HUMAN Cell division protein kinase 2 Protein cereblon/Cyclin-dependent kinase 2 | p33 protein kinase
Type:
Enzyme Subunit
Mol. Mass.:
33938.17
Organism:
Homo sapiens (Human)
Description:
P24941
Residue:
298
  
Component 2
Name:
G1/S-specific cyclin-E1
Synonyms:
CCNE CCNE1_HUMAN
Type:
Enzyme Subunit
Mol. Mass.:
47073.17
Organism:
Homo sapiens (Human)
Description:
Residue:
410
  
Inhibitor
Name:
BDBM6358
Synonyms:
8-Cyclopentyl-2-(4-piperazin-1-yl-phenylamino)-8H-pyrido[2,3-d]pyrimidin-7-one Pyrido[2,3-d]pyrimidin-7-one 5
Type:
Small organic molecule
Emp. Form.:
C22H26N6O
Mol. Mass.:
390.4814
SMILES:
O=c1ccc2cnc(Nc3ccc(cc3)N3CCNCC3)nc2n1C1CCCC1
:
Substrate
Name:
GST-Rb fusion protein
Synonyms:
Glutathione S-transferase (GST)-retinoblastoma (Rb) fusion RB1 Rb | retinoblastoma
Type:
Other Protein Type
Mol. Mass.:
106410.17
Organism:
Homo sapiens (Human)
Description:
GST-60 kDa Rb fusion protein (comprising amino acids 378 to 928 of retinoblastoma)
Residue:
928