Target
3-phosphoinositide-dependent protein kinase 1
Ligand
BDBM236557
Substrate
Meas. Tech.
Mobility Shift Assay
pH
7.5±n/a
Temperature
301.15±n/a K
IC50
>10000±n/a nM
Comments
extracted
Citation
 Wu, FShu, C PI3K and/or mTOR inhibitor US Patent  US9365572 Publication Date 6/14/2016 
Target
Name:
3-phosphoinositide-dependent protein kinase 1
Synonyms:
3-Phosphoinositide-Dependent Protein Kinase 1 (PDK1) 3-phosphoinositide-dependent protein kinase 1 3-phosphoinositide-dependent protein kinase 1 (PDK-1) Isoform 2 of 3-phosphoinositide-dependent protein kinase 1 PDPK1 Phosphoinositide-dependent protein kinase 1 (PDK1) hPDK1
Type:
Enzyme
Mol. Mass.:
63157.65
Organism:
Homo sapiens (Human)
Description:
O15530
Residue:
556
  
Inhibitor
Name:
BDBM236557
Synonyms:
US9365572, 5
Type:
Small organic molecule
Emp. Form.:
C22H13F3N6O2
Mol. Mass.:
450.3728
SMILES:
Nc1ccc(cn1)-c1ccc2ncc3c(n(-c4cccc(c4)C(F)(F)F)c(=O)[nH]c3=O)c2n1
: