Target
Beta-secretase 2
Ligand
BDBM236585
Substrate
Meas. Tech.
Time-Resolved Endpoint Proteolysis Assay
pH
5±n/a
Ki
1±n/a nM
Comments
extracted
Citation
 Cumming, JNKaelin, Jr., DEScott, JDWu, WBurnett, DA C5, C6 oxacyclic-fused thiazine dioxide compounds as BACE inhibitors, compositions, and their use US Patent  US9365589 Publication Date 6/14/2016 
Target
Name:
Beta-secretase 2
Synonyms:
AEPLC ASP1 Asp 1 Aspartyl protease 1 BACE2_HUMAN Beta-secretase (BACE) Beta-secretase 2 (BACE-2) Beta-site APP-cleaving enzyme 2 Memapsin-1 beta-Secretase (BACE-2)
Type:
Protein
Mol. Mass.:
56171.20
Organism:
Homo sapiens (Human)
Description:
Q9Y5Z0
Residue:
518
  
Inhibitor
Name:
BDBM236585
Synonyms:
US9365589, 1l
Type:
Small organic molecule
Emp. Form.:
C20H23FN4O5S
Mol. Mass.:
450.484
SMILES:
Cc1nc(C(=O)Nc2ccc(F)c(c2)[C@]23COC[C@H]2S(=O)(=O)C(C)(C)C(=N)N3)c(C)o1
: