Target
Beta-secretase 2
Ligand
BDBM236599
Substrate
Meas. Tech.
Time-Resolved Endpoint Proteolysis Assay
pH
5±n/a
Ki
1±n/a nM
Comments
extracted
Citation
 Cumming, JNKaelin, Jr., DEScott, JDWu, WBurnett, DA C5, C6 oxacyclic-fused thiazine dioxide compounds as BACE inhibitors, compositions, and their use US Patent  US9365589 Publication Date 6/14/2016 
Target
Name:
Beta-secretase 2
Synonyms:
AEPLC ASP1 Asp 1 Aspartyl protease 1 BACE2_HUMAN Beta-secretase (BACE) Beta-secretase 2 (BACE-2) Beta-site APP-cleaving enzyme 2 Memapsin-1 beta-Secretase (BACE-2)
Type:
Protein
Mol. Mass.:
56171.20
Organism:
Homo sapiens (Human)
Description:
Q9Y5Z0
Residue:
518
  
Inhibitor
Name:
BDBM236599
Synonyms:
US9365589, 1z
Type:
Small organic molecule
Emp. Form.:
C19H20F3N5O4S
Mol. Mass.:
471.453
SMILES:
CC1(C)C(=N)N[C@]2(COC[C@H]2S1(=O)=O)c1cc(NC(=O)c2ccn(n2)C(F)F)ccc1F
: