Target
Ribosomal protein S6 kinase alpha-1
Ligand
BDBM236878
Substrate
Meas. Tech.
Phosphorylation Assay
Temperature
310.15±n/a K
IC50
5.96±n/a nM
Comments
extracted
Citation
 Blake, JChen, HChicarelli, MGaudino, JGazzard, LKintz, SMohr, PRobarge, KSchwarz, JZhou, A Serine/threonine kinase inhibitors US Patent  US9388171 Publication Date 7/12/2016 
Target
Name:
Ribosomal protein S6 kinase alpha-1
Synonyms:
90 kDa ribosomal protein S6 kinase 1 MAP kinase-activated protein kinase 1a RPS6KA1 RPS6KA1(Kin.Dom.2 - C-terminal) RSK1 Ribosomal S6 kinase 1 Ribosomal protein S6 kinase alpha 1 Ribosomal protein S6 kinase alpha-1 (RSK1) p90-RSK 1 p90S6K | pp90RSK1
Type:
Serine/threonine-protein kinase
Mol. Mass.:
82736.10
Organism:
Homo sapiens (Human)
Description:
Residue:
735
  
Inhibitor
Name:
BDBM236878
Synonyms:
US9388171, I-6
Type:
Small organic molecule
Emp. Form.:
C24H27FN4O3
Mol. Mass.:
438.4946
SMILES:
CC[C@@H](NC(=O)c1ccc2cnc(NC3CCOCC3)cc2n1)c1ccc(OC)c(F)c1
: