Target
Beta-lactamase
Ligand
BDBM50335803
Substrate
Meas. Tech.
Slow-Binding Inhibition Assay
pH
7±n/a
Ki
8.5e+4± 3.0e+4 nM
Comments
extracted
Citation
 Schlesinger, SRBruner, BFarmer, PJKim, SK Kinetic characterization of a slow-binding inhibitor of Bla2: thiomaltol. J Enzyme Inhib Med Chem 28:137-42 (2013)  
Target
Name:
Beta-lactamase
Synonyms:
BAS3245 Beta-lactamase II bla2
Type:
Enzyme
Mol. Mass.:
28177.23
Organism:
Bacillus anthracis
Description:
Q93T40
Residue:
256
  
Inhibitor
Name:
BDBM50335803
Synonyms:
3-hydroxy-2-methyl-4H-pyran-4-thione Thiomaltol
Type:
Small organic molecule
Emp. Form.:
C6H6O2S
Mol. Mass.:
142.176
SMILES:
Cc1occc(=S)c1O
: