Target
Lysine-specific demethylase 6B
Ligand
BDBM293710
Substrate
Meas. Tech.
JMJD3 Assay
Temperature
298.15±n/a K
IC50
550±n/a nM
Comments
extracted
Citation
 Boloor, AChen, YKWallace, MB Histone demethylase inhibitors US Patent  US10106534 Publication Date 10/23/2018 
Target
Name:
Lysine-specific demethylase 6B
Synonyms:
JMJD3 Jumonji domain-containing protein 3 KDM6B_HUMAN Lysine demethylase 6B Lysine-specific demethylase 6B (KDM6B(JMJD3)) | Lysine-specific demethylase 6B (KDM6B)
Type:
Protein
Mol. Mass.:
176672.55
Organism:
Homo sapiens (Human)
Description:
O15054
Residue:
1643
  
Inhibitor
Name:
BDBM293710
Synonyms:
3-({[(4S)-7-[(3-fluorophenyl)sulfanyl]-3,4-dihydro-2H-1- | US10106534, Example 52
Type:
Small organic molecule
Emp. Form.:
C22H19FN2O3S
Mol. Mass.:
410.461
SMILES:
OC(=O)c1ccncc1NC[C@H]1CCOc2cc(Sc3cccc(F)c3)ccc12
: