Target
Carbonic anhydrase 2
Ligand
BDBM11610
Substrate
Meas. Tech.
CA Inhibition Assay
pH
8.3±0
Temperature
298.15±0 K
Ki
4.74e+3±n/a nM
Citation
 Maresca, AScozzafava, AVullo, DSupuran, CT Dihalogenated sulfanilamides and benzolamides are effective inhibitors of the three ß-class carbonic anhydrases from Mycobacterium tuberculosis. J Enzyme Inhib Med Chem 28:384-7 (2013)  
Target
Name:
Carbonic anhydrase 2
Synonyms:
β-Carbonic anhydrase 2 (CA 2) MTCA2_MYCTU cynT | mtcA2
Type:
Enzyme
Mol. Mass.:
21788.97
Organism:
Mycobacterium tuberculosis
Description:
P9WPJ9
Residue:
207
  
Inhibitor
Name:
BDBM11610
Synonyms:
β-CA inhibitor, 9 4-amino-3-chloro-5-iodobenzene-1-sulfonamide | halogenosulfanilamide deriv. 11
Type:
Small organic molecule
Emp. Form.:
C6H6ClIN2O2S
Mol. Mass.:
332.547
SMILES:
Nc1c(Cl)cc(cc1I)S(N)(=O)=O
: