Target
Carbonic anhydrase 2
Ligand
BDBM10886
Substrate
Meas. Tech.
CA Inhibition Assay
pH
8.3±0
Temperature
298.15±0 K
Ki
4.6e+2±n/a nM
Citation
 Maresca, AScozzafava, AVullo, DSupuran, CT Dihalogenated sulfanilamides and benzolamides are effective inhibitors of the three ß-class carbonic anhydrases from Mycobacterium tuberculosis. J Enzyme Inhib Med Chem 28:384-7 (2013)  
Target
Name:
Carbonic anhydrase 2
Synonyms:
β-Carbonic anhydrase 2 (CA 2) MTCA2_MYCTU cynT | mtcA2
Type:
Enzyme
Mol. Mass.:
21788.97
Organism:
Mycobacterium tuberculosis
Description:
P9WPJ9
Residue:
207
  
Inhibitor
Name:
BDBM10886
Synonyms:
2-N-benzene-1,3,4-thiadiazole-2,5-disulfonamide Benzolamide CHEMBL73962
Type:
Small organic molecule
Emp. Form.:
C8H8N4O4S3
Mol. Mass.:
320.369
SMILES:
NS(=O)(=O)c1nnc(NS(=O)(=O)c2ccccc2)s1
: