Target
Carbonic anhydrase 2
Ligand
BDBM239163
Substrate
Meas. Tech.
CA Inhibition Assay
pH
7.5±n/a
Temperature
298.15±n/a K
Ki
2.66e+3±n/a nM
Comments
extracted
Citation
 Maresca, AVullo, DScozzafava, AManole, GSupuran, CT Inhibition of the ß-class carbonic anhydrases from Mycobacterium tuberculosis with carboxylic acids. J Enzyme Inhib Med Chem 28:392-6 (2013)  
Target
Name:
Carbonic anhydrase 2
Synonyms:
β-Carbonic anhydrase 2 (CA 2) MTCA2_MYCTU cynT | mtcA2
Type:
Enzyme
Mol. Mass.:
21788.97
Organism:
Mycobacterium tuberculosis
Description:
P9WPJ9
Residue:
207
  
Inhibitor
Name:
BDBM239163
Synonyms:
4-Bromobenzoic acid (1)
Type:
Small organic molecule
Emp. Form.:
C7H5BrO2
Mol. Mass.:
201.017
SMILES:
OC(=O)c1ccc(Br)cc1
: