Target
Egl nine homolog 1
Ligand
BDBM240922
Substrate
Meas. Tech.
HIF-PH Assay
pH
7.4±n/a
IC50
47940±n/a nM
Comments
extracted
Citation
 Ho, WZhao, HDeng, SNg, DWright, LRWu, MZhou, XArend, MPFlippin, LA 4-hydroxy-isoquinoline compounds as HIF hydroxylase inhibitors US Patent  US9409892 Publication Date 8/9/2016 
Target
Name:
Egl nine homolog 1
Synonyms:
C1orf12 EGLN1_HUMAN Hypoxia-inducible factor prolyl hydroxylase 2 (HIF-PH2) Prolyl hydroxylase domain-containing protein 2 (PHD2)
Type:
Protein
Mol. Mass.:
46035.59
Organism:
Homo sapiens (Human)
Description:
Q9GZT9
Residue:
426
  
Inhibitor
Name:
BDBM240922
Synonyms:
US9409892, 17
Type:
Small organic molecule
Emp. Form.:
C23H21N3O5
Mol. Mass.:
419.4299
SMILES:
CCCC(CNC(=O)c1nc(C#N)c2cc(Oc3ccccc3)ccc2c1O)C(O)=O
: