Target
Plasma kallikrein
Ligand
BDBM241398
Substrate
BDBM241595
Meas. Tech.
In Vitro Assay
Temperature
298.15±n/a K
Ki
3±n/a nM
Citation
 Yang, WCorte, JRGilligan, PJPinto, DJEwing, WRDilger, AKWang, YFang, TPabbisetty, KBSmith, II, LM Dihydropyridone p1 as factor XIa inhibitors US Patent  US9409908 Publication Date 8/9/2016 
Target
Name:
Plasma kallikrein
Synonyms:
Fletcher factor KLKB1 Kallikrein Plasma kallikrein heavy chain Plasma prekallikrein
Type:
Protein
Mol. Mass.:
71391.16
Organism:
Homo sapiens (Human)
Description:
P03952
Residue:
638
  
Inhibitor
Name:
BDBM241398
Synonyms:
US9409908, 30 | US9951071, Example 30
Type:
Small organic molecule
Emp. Form.:
C32H29ClFN5O5
Mol. Mass.:
618.055
SMILES:
COC(=O)Nc1ccc-2c(NC(=O)[C@H](C)CCC[C@H](N3CCC(=CC3=O)c3c(F)c(Cl)ccc3C#N)c3cc-2cc(=O)[nH]3)c1
:
Substrate
Name:
BDBM241595
Synonyms:
US9409908, H-(D)-Pro-Phe-Arg-pNA
Type:
Small organic molecule
Emp. Form.:
C26H34N8O5
Mol. Mass.:
538.5988
SMILES:
[#7]\[#6](-[#7])=[#7]/[#6]-[#6]-[#6]-[#6@H](-[#7]-[#6](=O)-[#6@H](-[#6]-c1ccccc1)-[#7]-[#6](=O)-[#6@H]-1-[#6]-[#6]-[#6]-[#7]-1)-[#6](=O)-[#7]-c1ccc(cc1)-[#7+](-[#8-])=O
: