Target
Proto-oncogene tyrosine-protein kinase Src
Ligand
BDBM6468
Substrate
cdc2 substrate peptide
Meas. Tech.
Kinase inhibition Assay
pH
7.5±n/a
Temperature
303.15±n/a K
IC50
13±n/a nM
Citation
 Berger, DMDutia, MBirnberg, GPowell, DBoschelli, DHWang, YDRavi, MYaczko, DGolas, JLucas, JBoschelli, F 4-Anilino-7,8-dialkoxybenzo[g]quinoline-3-carbonitriles as potent Src kinase inhibitors. J Med Chem 48:5909-20 (2005)  
Target
Name:
Proto-oncogene tyrosine-protein kinase Src
Synonyms:
Calmodulin/Proto-oncogene tyrosine-protein kinase Src Proto-oncogene c-Src SRC SRC_HUMAN V-src sarcoma (Schmidt-Ruppin A-2) viral oncogene homolog (avian) p60-Src | pp60c-src
Type:
Protein
Mol. Mass.:
59838.60
Organism:
Homo sapiens (Human)
Description:
P12931
Residue:
536
  
Inhibitor
Name:
BDBM6468
Synonyms:
4-Anilino-7,8-dialkoxybenzo[g]quinoline-3-carbonitrile 16i | 4-[(2,4-dichlorophenyl)amino]-8-methoxy-7-[2-(morpholin-4-yl)ethoxy]benzo[g]quinoline-3-carbonitrile
Type:
Small organic molecule
Emp. Form.:
C27H24Cl2N4O3
Mol. Mass.:
523.41
SMILES:
COc1cc2cc3ncc(C#N)c(Nc4ccc(Cl)cc4Cl)c3cc2cc1OCCN1CCOCC1
:
Substrate
Name:
cdc2 substrate peptide
Synonyms:
Type:
Peptide
Mol. Mass.:
358.43
Organism:
Description:
100 uM ATP as co-substrate
Residue:
3
NA