Target
Proto-oncogene tyrosine-protein kinase Src
Ligand
BDBM6472
Substrate
cdc2 substrate peptide
Meas. Tech.
Kinase inhibition Assay
pH
7.5±n/a
Temperature
303.15±n/a K
IC50
0.29±n/a nM
Citation
 Berger, DMDutia, MBirnberg, GPowell, DBoschelli, DHWang, YDRavi, MYaczko, DGolas, JLucas, JBoschelli, F 4-Anilino-7,8-dialkoxybenzo[g]quinoline-3-carbonitriles as potent Src kinase inhibitors. J Med Chem 48:5909-20 (2005)  
Target
Name:
Proto-oncogene tyrosine-protein kinase Src
Synonyms:
Calmodulin/Proto-oncogene tyrosine-protein kinase Src Proto-oncogene c-Src SRC SRC_HUMAN V-src sarcoma (Schmidt-Ruppin A-2) viral oncogene homolog (avian) p60-Src | pp60c-src
Type:
Protein
Mol. Mass.:
59838.60
Organism:
Homo sapiens (Human)
Description:
P12931
Residue:
536
  
Inhibitor
Name:
BDBM6472
Synonyms:
4-Anilino-7,8-dialkoxybenzo[g]quinoline-3-carbonitrile 17d | 4-[(2,4-dichloro-5-methoxyphenyl)amino]-7-methoxy-8-[2-(4-methylpiperazin-1-yl)ethoxy]benzo[g]quinoline-3-carbonitrile
Type:
Small organic molecule
Emp. Form.:
C29H29Cl2N5O3
Mol. Mass.:
566.478
SMILES:
COc1cc(Nc2c(cnc3cc4cc(OCCN5CCN(C)CC5)c(OC)cc4cc23)C#N)c(Cl)cc1Cl
:
Substrate
Name:
cdc2 substrate peptide
Synonyms:
Type:
Peptide
Mol. Mass.:
358.43
Organism:
Description:
100 uM ATP as co-substrate
Residue:
3
NA