Target
P2X purinoceptor 7
Ligand
BDBM242043
Substrate
Meas. Tech.
Fluorescent Imaging Plate Reader (FLIPR) Assay
pH
7.4±n/a
Temperature
310.15±n/a K
IC50
1.3±n/a nM
Comments
extracted
Citation
 Kilburn, JPRasmussen, LKJessing, MEldemenky, EMChen, BJiang, Y Cyclic amines US Patent  US9415055 Publication Date 8/16/2016 
Target
Name:
P2X purinoceptor 7
Synonyms:
ATP receptor P2RX7_HUMAN P2X purinoceptor 7 (P2X7) P2Z receptor | Purinergic receptor
Type:
Protein
Mol. Mass.:
68602.85
Organism:
Homo sapiens (Human)
Description:
Q99572
Residue:
595
  
Inhibitor
Name:
BDBM242043
Synonyms:
US9415055, 2,3-dichloro-N-[2-(4,4-difluoro-1-piperidyl)-2-[6-(trifluoromethyl)-3-pyridyl]ethyl]benzamide | US9593105, 44
Type:
Small organic molecule
Emp. Form.:
C20H18Cl2F5N3O
Mol. Mass.:
482.274
SMILES:
FC(F)(F)c1ccc(cn1)C(CNC(=O)c1cccc(Cl)c1Cl)N1CCC(F)(F)CC1
: