Target
P2X purinoceptor 7
Ligand
BDBM242093
Substrate
Meas. Tech.
Fluorescent Imaging Plate Reader (FLIPR) Assay
pH
7.4±n/a
Temperature
310.15±n/a K
IC50
1.7±n/a nM
Comments
extracted
Citation
 Kilburn, JPRasmussen, LKJessing, MEldemenky, EMChen, BJiang, Y Cyclic amines US Patent  US9415055 Publication Date 8/16/2016 
Target
Name:
P2X purinoceptor 7
Synonyms:
ATP receptor P2RX7_HUMAN P2X purinoceptor 7 (P2X7) P2Z receptor | Purinergic receptor
Type:
Protein
Mol. Mass.:
68602.85
Organism:
Homo sapiens (Human)
Description:
Q99572
Residue:
595
  
Inhibitor
Name:
BDBM242093
Synonyms:
US9415055, (+)2-chloro-N-[2-(4,4-difluoro-1-piperidyl)-2-[2-(trifluoromethyl)pyrimidin-5-yl]ethyl]-3-fluoro-benzamide | US9593105, 95
Type:
Small organic molecule
Emp. Form.:
C19H17ClF6N4O
Mol. Mass.:
466.808
SMILES:
Fc1cccc(C(=O)NCC(N2CCC(F)(F)CC2)c2cnc(nc2)C(F)(F)F)c1Cl
: