Target
P2X purinoceptor 7
Ligand
BDBM242182
Substrate
Meas. Tech.
Fluorescent Imaging Plate Reader (FLIPR) Assay
pH
7.4±n/a
Temperature
310.15±n/a K
IC50
3.5±n/a nM
Comments
extracted
Citation
 Kilburn, JPRasmussen, LKJessing, MEldemenky, EMChen, BJiang, Y Cyclic amines US Patent  US9415055 Publication Date 8/16/2016 
Target
Name:
P2X purinoceptor 7
Synonyms:
ATP receptor P2RX7_HUMAN P2X purinoceptor 7 (P2X7) P2Z receptor | Purinergic receptor
Type:
Protein
Mol. Mass.:
68602.85
Organism:
Homo sapiens (Human)
Description:
Q99572
Residue:
595
  
Inhibitor
Name:
BDBM242182
Synonyms:
US9415055, (-)2,3-dichloro-N-[2-(2-cyclopropylpyrimidin-5-yl)-2-(4,4-difluoro-1-piperidyl)ethyl]benzamide | US9593105, 184
Type:
Small organic molecule
Emp. Form.:
C21H22Cl2F2N4O
Mol. Mass.:
455.328
SMILES:
FC1(F)CCN(CC1)C(CNC(=O)c1cccc(Cl)c1Cl)c1cnc(nc1)C1CC1
: