Target
Proto-oncogene tyrosine-protein kinase Src
Ligand
BDBM6478
Substrate
cdc2 substrate peptide
Meas. Tech.
Kinase inhibition Assay
pH
7.5±n/a
Temperature
303.15±n/a K
IC50
0.69±n/a nM
Citation
 Berger, DDutia, MPowell, DWissner, ADeMorin, FRaifeld, YWeber, JBoschelli, F Substituted 4-anilino-7-phenyl-3-quinolinecarbonitriles as Src kinase inhibitors. Bioorg Med Chem Lett 12:2989-92 (2002)  
Target
Name:
Proto-oncogene tyrosine-protein kinase Src
Synonyms:
Calmodulin/Proto-oncogene tyrosine-protein kinase Src Proto-oncogene c-Src SRC SRC_HUMAN V-src sarcoma (Schmidt-Ruppin A-2) viral oncogene homolog (avian) p60-Src | pp60c-src
Type:
Protein
Mol. Mass.:
59838.60
Organism:
Homo sapiens (Human)
Description:
P12931
Residue:
536
  
Inhibitor
Name:
BDBM6478
Synonyms:
4-Anilino-7,8-dialkoxybenzo[g]quinoline-3-carbonitrile 17i | 7-methoxy-8-[2-(4-methylpiperazin-1-yl)ethoxy]-4-[(3,4,5-trimethoxyphenyl)amino]benzo[g]quinoline-3-carbonitrile
Type:
Small organic molecule
Emp. Form.:
C31H35N5O5
Mol. Mass.:
557.6401
SMILES:
COc1cc2cc3c(Nc4cc(OC)c(OC)c(OC)c4)c(cnc3cc2cc1OCCN1CCN(C)CC1)C#N
:
Substrate
Name:
cdc2 substrate peptide
Synonyms:
Type:
Peptide
Mol. Mass.:
358.43
Organism:
Description:
100 uM ATP as co-substrate
Residue:
3
NA