Target
Neurogenic locus notch homolog protein 3/Recombining binding protein suppressor of hairless
Ligand
BDBM242875
Substrate
Meas. Tech.
Transactivation Assay
IC50
8.9±n/a nM
Citation
 Zhao, YGavai, AVGill, PKim, SFink, BEChen, LSaulnier, MGHan, W Fluoroalkyl and fluorocycloalkyl 1,4-benzodiazepinone compounds US Patent  US9427442 Publication Date 8/30/2016 
Target
Name:
Neurogenic locus notch homolog protein 3/Recombining binding protein suppressor of hairless
Synonyms:
Notch 3-CBF1 | Notch3-CBF1
Type:
Enzyme
Mol. Mass.:
Description:
Components:
This complex has 2 components.
Component 1
Name:
Neurogenic locus notch homolog protein 3
Synonyms:
NOTC3_HUMAN Neurogenic locus notch homolog protein 3 Notch 3 Notch 3 intracellular domain | Notch 3 intracellular domain (Notch 3)
Type:
Enzyyme
Mol. Mass.:
243579.59
Organism:
Homo sapiens (Human)
Description:
Q9UM47
Residue:
2321
  
Component 2
Name:
Recombining binding protein suppressor of hairless
Synonyms:
C-promoter binding factor I (CBF1) IGKJRB1 RBPJK Recombining binding protein suppressor of hairless (CBF1) | SUH_HUMAN
Type:
Enzyme
Mol. Mass.:
55640.53
Organism:
Homo sapiens (Human)
Description:
Q06330
Residue:
500
  
Inhibitor
Name:
BDBM242875
Synonyms:
US9427442, 3
Type:
Small organic molecule
Emp. Form.:
C31H32F6N4O4
Mol. Mass.:
638.6006
SMILES:
NC(=O)[C@H]([C@@H](CCC(F)(F)F)C(=O)N[C@H]1N=C(c2cccc(F)c2)c2cccc(OC3CC3)c2NC1=O)C1CCC(F)(F)CC1
: