Target
Neurogenic locus notch homolog protein 3/Recombining binding protein suppressor of hairless
Ligand
BDBM209912
Substrate
Meas. Tech.
Transactivation Assay
IC50
12.5±n/a nM
Citation
 Zhao, YGavai, AVGill, PKim, SFink, BEChen, LSaulnier, MGHan, W Fluoroalkyl and fluorocycloalkyl 1,4-benzodiazepinone compounds US Patent  US9427442 Publication Date 8/30/2016 
Target
Name:
Neurogenic locus notch homolog protein 3/Recombining binding protein suppressor of hairless
Synonyms:
Notch 3-CBF1 | Notch3-CBF1
Type:
Enzyme
Mol. Mass.:
Description:
Components:
This complex has 2 components.
Component 1
Name:
Neurogenic locus notch homolog protein 3
Synonyms:
NOTC3_HUMAN Neurogenic locus notch homolog protein 3 Notch 3 Notch 3 intracellular domain | Notch 3 intracellular domain (Notch 3)
Type:
Enzyyme
Mol. Mass.:
243579.59
Organism:
Homo sapiens (Human)
Description:
Q9UM47
Residue:
2321
  
Component 2
Name:
Recombining binding protein suppressor of hairless
Synonyms:
C-promoter binding factor I (CBF1) IGKJRB1 RBPJK Recombining binding protein suppressor of hairless (CBF1) | SUH_HUMAN
Type:
Enzyme
Mol. Mass.:
55640.53
Organism:
Homo sapiens (Human)
Description:
Q06330
Residue:
500
  
Inhibitor
Name:
BDBM209912
Synonyms:
US9273014, Comparative Compound 48 | US9427442, Comparative Compound 29
Type:
Small organic molecule
Emp. Form.:
C29H36N4O3
Mol. Mass.:
488.6211
SMILES:
CCCN1c2ccccc2C(=N[C@H](NC(=O)[C@H](CC(C)C)[C@H](CC=C)C(N)=O)C1=O)c1ccccc1
: