Target
Tyrosine-protein phosphatase non-receptor type 1 [1-321]
Ligand
BDBM50391109
Substrate
Meas. Tech.
PTP1B Activity Assay
pH
7.5±0
Temperature
310.15±0 K
IC50
25.39±0.65 nM
Citation
 Adisakwattana, SPongsuwan, JWungcharoen, CYibchok-anun, S In vitro effects of cinnamic acid derivatives on protein tyrosine phosphatase 1B. J Enzyme Inhib Med Chem 28:1067-72 (2013)  
Target
Name:
Tyrosine-protein phosphatase non-receptor type 1 [1-321]
Synonyms:
PTN1_HUMAN PTPN1 | Protein tyrosine phosphatase 1B (PTP1B)
Type:
Enzyme
Mol. Mass.:
37311.71
Organism:
Homo sapiens (Human)
Description:
P18031 (1-321 aa)
Residue:
321
  
Inhibitor
Name:
BDBM50391109
Synonyms:
CHEMBL179166 Vanadates
Type:
Small organic molecule
Emp. Form.:
O4V
Mol. Mass.:
114.9407
SMILES:
[O-][V]([O-])([O-])=O
: