Target
Alpha-glucosidase MAL12
Ligand
BDBM243070
Substrate
Meas. Tech.
α-glucosidase Inhibitory Activity Assay
pH
7±n/a
Temperature
298.15±n/a K
IC50
>3.00e+5±n/a nM
Comments
extracted
Citation
 Kashima, YYamaki, HSuzuki, TMiyazawa, M Structure-activity relationships of bergenin derivatives effect on a-glucosidase inhibition. J Enzyme Inhib Med Chem 28:1162-70 (2013)  
Target
Name:
Alpha-glucosidase MAL12
Synonyms:
α-Glucosidase MAL12_YEAST Maltase | alpha-Glucosidase (α-Glucosidase)
Type:
Protein
Mol. Mass.:
68084.32
Organism:
Saccharomyces cerevisiae
Description:
P53341
Residue:
584
  
Inhibitor
Name:
BDBM243070
Synonyms:
11-O-(3',5'-dimethoxybenzoyl)-bergenin (8)
Type:
Small organic molecule
Emp. Form.:
C23H24O12
Mol. Mass.:
492.4295
SMILES:
COc1cc(OC)cc(c1)C(=O)OC[C@H]1OC2C(OC(=O)c3cc(O)c(OC)c(O)c23)[C@@H](O)[C@@H]1O
: