Target
Alpha-glucosidase MAL12
Ligand
BDBM50100861
Substrate
Meas. Tech.
α-glucosidase Inhibitory Activity Assay
pH
7±n/a
Temperature
298.15±n/a K
IC50
>3.00e+5±n/a nM
Comments
extracted
Citation
 Kashima, YYamaki, HSuzuki, TMiyazawa, M Structure-activity relationships of bergenin derivatives effect on a-glucosidase inhibition. J Enzyme Inhib Med Chem 28:1162-70 (2013)  
Target
Name:
Alpha-glucosidase MAL12
Synonyms:
α-Glucosidase MAL12_YEAST Maltase | alpha-Glucosidase (α-Glucosidase)
Type:
Protein
Mol. Mass.:
68084.32
Organism:
Saccharomyces cerevisiae
Description:
P53341
Residue:
584
  
Inhibitor
Name:
BDBM50100861
Synonyms:
3,4-Dihydroxybenzoate, VIII 4,5-Dihydroxybenzoic acid CHEMBL37537 Protocatechuic acid (M1) cid_72
Type:
Small organic molecule
Emp. Form.:
C7H6O4
Mol. Mass.:
154.1201
SMILES:
OC(=O)c1ccc(O)c(O)c1
: