Target
Alpha-glucosidase MAL12
Ligand
BDBM243074
Substrate
Meas. Tech.
Inhibition Assay
pH
7±n/a
IC50
2.51e+4±n/a nM
Comments
extracted
Citation
 Yousefi, RAlavian-Mehr, MMMokhtari, FPanahi, FMehraban, MHKhalafi-Nezhad, A Pyrimidine-fused heterocycle derivatives as a novel class of inhibitors for a-glucosidase. J Enzyme Inhib Med Chem 28:1228-35 (2013)  
Target
Name:
Alpha-glucosidase MAL12
Synonyms:
α-Glucosidase MAL12_YEAST Maltase | alpha-Glucosidase (α-Glucosidase)
Type:
Protein
Mol. Mass.:
68084.32
Organism:
Saccharomyces cerevisiae
Description:
P53341
Residue:
584
  
Inhibitor
Name:
BDBM243074
Synonyms:
α-Gl inhibitor, C2
Type:
Small organic molecule
Emp. Form.:
C20H20BrN5O9
Mol. Mass.:
554.305
SMILES:
OCC(O)C(O)C(O)C(O)C1c2c([nH]c(=O)[nH]c2=O)N(c2ccc(Br)cc2)c2[nH]c(=O)[nH]c(=O)c12
: