Target
Lysosomal alpha-glucosidase
Ligand
BDBM243075
Substrate
Meas. Tech.
Inhibition Assay
pH
7±n/a
IC50
6.41e+4±n/a nM
Comments
extracted
Citation
 Yousefi, RAlavian-Mehr, MMMokhtari, FPanahi, FMehraban, MHKhalafi-Nezhad, A Pyrimidine-fused heterocycle derivatives as a novel class of inhibitors for a-glucosidase. J Enzyme Inhib Med Chem 28:1228-35 (2013)  
Target
Name:
Lysosomal alpha-glucosidase
Synonyms:
α-Glucosidase Gaa Lysosomal alpha-glucosidase | alpha-glucosidase (Gaa)
Type:
Enzyme
Mol. Mass.:
106235.32
Organism:
Mus musculus (Mouse)
Description:
P70699
Residue:
953
  
Inhibitor
Name:
BDBM243075
Synonyms:
α-Gl inhibitor, C3
Type:
Small organic molecule
Emp. Form.:
C26H26N6O11S
Mol. Mass.:
630.583
SMILES:
Nc1ccc(cc1)S(=O)(=O)c1ccc(cc1)N1c2[nH]c(=O)[nH]c(=O)c2C(C(O)C(O)C(O)C(O)CO)c2c1[nH]c(=O)[nH]c2=O
: