Target
Atypical chemokine receptor 3
Ligand
BDBM243658
Substrate
Meas. Tech.
In Vitro Assay
Temperature
310.15±n/a K
EC50
51±n/a nM
Comments
extracted
Citation
 Fretz, HGude, MGuerry, PKimmerlin, TLehembre, FPfeifer, TValdenaire, A 1-[m-carboxamido(hetero)aryl-methyl]-heterocyclyl-carboxamide derivatives US Patent  US9428456 Publication Date 8/30/2016 
Target
Name:
Atypical chemokine receptor 3
Synonyms:
ACKR3 C-X-C chemokine receptor type 7 CMKOR1 CXCR-7 Chemokine orphan receptor 1 G-protein coupled receptor RDC1 homolog RDC-1 | RDC1
Type:
Enzyme
Mol. Mass.:
41498.84
Organism:
Homo sapiens (Human)
Description:
P25106
Residue:
362
  
Inhibitor
Name:
BDBM243658
Synonyms:
US9428456, 1.180
Type:
Small organic molecule
Emp. Form.:
C26H33ClN4O2
Mol. Mass.:
469.019
SMILES:
CC(N1CCC(CC1)C(=O)NC1CCCCC1)c1cccc(NC(=O)c2cc(Cl)ccn2)c1
: