Target
Atypical chemokine receptor 3
Ligand
BDBM243677
Substrate
Meas. Tech.
In Vitro Assay
Temperature
310.15±n/a K
EC50
19±n/a nM
Comments
extracted
Citation
 Fretz, HGude, MGuerry, PKimmerlin, TLehembre, FPfeifer, TValdenaire, A 1-[m-carboxamido(hetero)aryl-methyl]-heterocyclyl-carboxamide derivatives US Patent  US9428456 Publication Date 8/30/2016 
Target
Name:
Atypical chemokine receptor 3
Synonyms:
ACKR3 C-X-C chemokine receptor type 7 CMKOR1 CXCR-7 Chemokine orphan receptor 1 G-protein coupled receptor RDC1 homolog RDC-1 | RDC1
Type:
Enzyme
Mol. Mass.:
41498.84
Organism:
Homo sapiens (Human)
Description:
P25106
Residue:
362
  
Inhibitor
Name:
BDBM243677
Synonyms:
US9428456, 1.298
Type:
Small organic molecule
Emp. Form.:
C25H32FN3O3
Mol. Mass.:
441.5383
SMILES:
COc1ccc(NC(=O)c2ccc(F)cc2)cc1CN1CCC(CC1)C(=O)NC(C)(C)C
: