Target
Androgen receptor [W742C]
Ligand
BDBM245154
Substrate
Meas. Tech.
Transactivation Assay
Temperature
310.15±n/a K
IC50
220±n/a nM
Comments
extracted
Citation
 Nguyen, DKünzer, HFaus Gimenez, HBader, BKöhr, SFritsch, M N-[4-(quinolin-4-yloxy)cyclohexyl(methyl)](hetero)arylcarboxamides as androgen receptor antagonists, production and use thereof as medicinal products US Patent  US9428460 Publication Date 8/30/2016 
Target
Name:
Androgen receptor [W742C]
Synonyms:
ANDR_HUMAN Androgen receptor (W742C) NR3C4
Type:
Enzyme
Mol. Mass.:
99102.20
Organism:
Homo sapiens (Human)
Description:
Entry Version 159, Sequence Version 2 (P10275)
Residue:
920
  
Inhibitor
Name:
BDBM245154
Synonyms:
US9428460, 10
Type:
Small organic molecule
Emp. Form.:
C23H23FN2O2
Mol. Mass.:
378.4393
SMILES:
Fc1cccc(c1)C(=O)NC[C@H]1CC[C@@H](CC1)Oc1ccnc2ccccc12
: