Target
Coagulation factor X
Ligand
BDBM50024354
Substrate
Meas. Tech.
Human Coagulation Factor Xa Assay
pH
8.3±n/a
Ki
1.93±n/a nM
Comments
extracted
Citation
 Chen, SDing, ZGong, GYan, XHuang, WGuo, FDuan, BGao, RZhou, PLu, XDong, G Preparation method for benzoxazoleoxazine ketone compound and intermediate and crystal form thereof US Patent  US10106557 Publication Date 10/23/2018 
Target
Name:
Coagulation factor X
Synonyms:
Activated coagulation factor X (FXa) Coagulation factor X precursor F10 Factor X heavy chain Factor Xa Stuart-Prower factor
Type:
Enzyme
Mol. Mass.:
54726.60
Organism:
Homo sapiens (Human)
Description:
Residue:
488
  
Inhibitor
Name:
BDBM50024354
Synonyms:
CHEMBL3330444 | US10106557, Compound 2
Type:
Small organic molecule
Emp. Form.:
C21H20ClN3O5S
Mol. Mass.:
461.919
SMILES:
[H][C@@]12COc3cc(ccc3N1C(=O)O[C@H]2CNC(=O)c1ccc(Cl)s1)N1CCCCC1=O
: