Target
Parathyroid hormone/parathyroid hormone-related peptide receptor
Ligand
BDBM64567
Substrate
Meas. Tech.
cAMP Assay
pH
7.4±n/a
EC50
3200±n/a nM
Comments
extracted
Citation
 Nishimura, YEsaki, TTamura, T Hydantoin derivative US Patent  US9428505 Publication Date 8/30/2016 
Target
Name:
Parathyroid hormone/parathyroid hormone-related peptide receptor
Synonyms:
PTH1R_RAT Parathyroid hormone/parathyroid hormone-related peptide receptor Pthr | Pthr1
Type:
Enzyme
Mol. Mass.:
66273.93
Organism:
Rattus norvegicus (Rat)
Description:
P25961
Residue:
591
  
Inhibitor
Name:
BDBM64567
Synonyms:
US9428505, Compound 11
Type:
Emp. Form.:
C29H30F3N5O6S
Mol. Mass.:
633.639
SMILES:
Cc1cc(cc(C)c1CCS(=O)(=O)N1CCC2(CC1)N=C(NC2=O)c1ccc(OC(F)(F)F)cc1)N1C(=O)NC(=O)C11CC1
: