Target
Serine-protein kinase ATM
Ligand
BDBM245526
Substrate
Meas. Tech.
Cellular Assay
Temperature
310.15±n/a K
IC50
0.715±n/a nM
Comments
extracted
Citation
 Barlaam, BCPike, KG Imidazo[4,5-c]quinolin-2-one compounds and their use in treating Cancer US Patent  US9428503 Publication Date 8/30/2016 
Target
Name:
Serine-protein kinase ATM
Synonyms:
A-T mutated ATM_HUMAN | Ataxia telangiectasia mutated
Type:
Protein
Mol. Mass.:
350696.72
Organism:
Homo sapiens (Human)
Description:
Q13315
Residue:
3056
  
Inhibitor
Name:
BDBM245526
Synonyms:
US9428503, 54
Type:
Small organic molecule
Emp. Form.:
C28H33N5O3
Mol. Mass.:
487.5933
SMILES:
Cn1c2cnc3ccc(cc3c2n([C@@H]2CCOC2)c1=O)-c1ccc(OCCCN2CCCCC2)nc1
: