Target
Serine/threonine-protein kinase mTOR
Ligand
BDBM245539
Substrate
Meas. Tech.
Cellular Assay
Temperature
310.15±n/a K
IC50
>30000±n/a nM
Comments
extracted
Citation
 Barlaam, BCPike, KG Imidazo[4,5-c]quinolin-2-one compounds and their use in treating Cancer US Patent  US9428503 Publication Date 8/30/2016 
Target
Name:
Serine/threonine-protein kinase mTOR
Synonyms:
FK506-binding protein 12-rapamycin complex-associated protein 1 FRAP FRAP1 MTOR Mammalian Target of Rapamycin (mTOR) RAFT1 Rapamycin and FKBP12 target 1 Serine/threonine-protein kinase (mTOR) | mTORC2
Type:
Rapamycin target protein
Mol. Mass.:
288917.12
Organism:
Homo sapiens (Human)
Description:
P42345
Residue:
2549
  
Inhibitor
Name:
BDBM245539
Synonyms:
US9428503, 70
Type:
Small organic molecule
Emp. Form.:
C27H32FN5O3
Mol. Mass.:
493.5731
SMILES:
CO[C@H]1CC[C@H](C1)n1c2c(cnc3cc(F)c(cc23)-c2ccc(OCCCN(C)C)nc2)n(C)c1=O
: