Target
Urease
Ligand
BDBM246421
Substrate
Meas. Tech.
Inhibition Assay
pH
6.8±n/a
Ki
11890±4 nM
IC50
9330±20 nM
Km
2250000±n/a nM
Comments
extracted
Citation
 Choudhary, MIKhan, AKhan, KMAmbreen, NWahab, ARahman, A Schiff bases of thiazoles: a new class of ureases inhibitors US Patent  US9447057 Publication Date 9/20/2016 
Target
Name:
Urease
Synonyms:
UREA_CANEN | Urea amidohydrolase
Type:
Enzyme
Mol. Mass.:
90746.20
Organism:
Canavalia ensiformis (Jack bean) (Horse bean)
Description:
P07374
Residue:
840
  
Inhibitor
Name:
BDBM246421
Synonyms:
US9447057, 7
Type:
Small organic molecule
Emp. Form.:
C20H14N2S
Mol. Mass.:
314.404
SMILES:
C(=N/c1nc(cs1)-c1ccccc1)\c1ccc2ccccc2c1
: